Reaction Details
TargetRenin
LigandBDBM50036990
Substrate/Competitorn/a
Meas. Tech.ChEMBL_192898 (CHEMBL795111)
IC50 75±n/a nM
Citation Boyd, SAFung, AKBaker, WRMantei, RAStein, HHCohen, JBarlow, JLKlinghofer, VWessale, JLVerburg, KM Nonpeptide renin inhibitors with good intraduodenal bioavailability and efficacy in dog. J Med Chem37:2991-3007 (1994) Renin
Name:Renin
Type:Enzyme
Mol. Mass.:45058.99
Organism:Homo sapiens (Human)
Description:n/a
Residue:406
BDBM50036990
NameBDBM50036990
Synonyms:(2S,4S,5S)-5-{(S)-2-[(S)-1-Benzyl-2-(4-methoxymethoxy-piperidin-1-yl)-2-oxo-ethylamino]-hexanoylamino}-6-cyclohexyl-4-hydroxy-2-isopropyl-hexanoic acid (pyridin-2-ylmethyl)-amide | CHEMBL263683
TypeSmall organic molecule
Emp. Form.C43H67N5O6
Mol. Mass.750.022
SMILESCCCC[C@H](N[C@@H](Cc1ccccc1)C(=O)N1CCC(CC1)OCOC)C(=O)N[C@@H](CC1CCCCC1)[C@@H](O)C[C@@H](C(C)C)C(=O)NCc1ccccn1