Reaction Details
TargetGag-Pol polyprotein [489-587]
LigandBDBM50037126
Substrate/Competitorn/a
Meas. Tech.ChEMBL_157870 (CHEMBL879227)
Ki 92±n/a nM
Citation Thompson, SKMurthy, KHZhao, BWinborne, EGreen, DWFisher, SMDesJarlais, RLTomaszek, TAMeek, TDGleason, JG Rational design, synthesis, and crystallographic analysis of a hydroxyethylene-based HIV-1 protease inhibitor containing a heterocyclic P1'--P2' amide bond isostere. J Med Chem37:3100-7 (1994) Gag-Pol polyprotein [489-587]
Name:Gag-Pol polyprotein [489-587]
Type:Enzyme Subunit
Mol. Mass.:10781.16
Organism:Human immunodeficiency virus type 1
Description:P04585[489-587]
Residue:99
BDBM50037126
NameBDBM50037126
Synonyms:CHEMBL80098 | [(1S,2S,4R)-1-Benzyl-2-hydroxy-5-phenyl-4-(5-propionyl-1H-imidazol-2-yl)-pentyl]-carbamic acid tert-butyl ester
TypeSmall organic molecule
Emp. Form.C29H37N3O4
Mol. Mass.491.6218
SMILESCCC(=O)c1cnc([nH]1)[C@@H](C[C@H](O)[C@H](Cc1ccccc1)NC(=O)OC(C)(C)C)Cc1ccccc1