Reaction Details
TargetMu-type opioid receptor
LigandBDBM50037134
Substrate/Competitorn/a
Meas. Tech.ChEMBL_138749 (CHEMBL747922)
Ki 0.57±n/a nM
Citation Cheng, CYHsin, LWTsai, MCSchmidt, WKSmith, CTam, SW Synthesis and opioid activity of 7-oxygenated 2,3,4,4a,5,6,7,7a-octahydro-1H-benzofuro[3,2-e]isoquinolin-9-ols. J Med Chem37:3121-7 (1994) Mu-type opioid receptor
Name:Mu-type opioid receptor
Type:Enzyme Catalytic Domain
Mol. Mass.:11165.58
Organism:GUINEA PIG
Description:P97266
Residue:98
BDBM50037134
NameBDBM50037134
Synonyms:(+)-trans-3-Cyclopropylmethyl-2,3,4,4aalpha,5,6,7,7aalpha-octahydro-1H-benzo[4,5]furo[3,2-e]isoquinolin-9-ol (-)-trans-3-Cyclopropylmethyl-2,3,4,4aalpha,5,6,7,7aalpha-octahydro-1H-benzo[4,5]furo[3,2-e]isoquinolin-9-ol CHEMBL104042
TypeSmall organic molecule
Emp. Form.C19H25NO2
Mol. Mass.299.4073
SMILESOc1cccc2c1O[C@H]1CCC[C@H]3CN(CC4CC4)CC[C@]213