Reaction Details
TargetAcetylcholinesterase
LigandBDBM50037158
Substrate/Competitorn/a
Meas. Tech.ChEMBL_29233 (CHEMBL641567)
IC50 0.38±n/a nM
Citation Yamamoto, YIshihara, YKuntz, ID Docking analysis of a series of benzylamino acetylcholinesterase inhibitors with a phthalimide, benzoyl, or indanone moiety. J Med Chem37:3141-53 (1994) Acetylcholinesterase
Name:Acetylcholinesterase
Type:Enzyme
Mol. Mass.:68193.62
Organism:Rattus norvegicus (rat)
Description:P37136
Residue:614
BDBM50037158
NameBDBM50037158
Synonyms:CHEMBL106739 | Methyl-carbamic acid 3-({ethyl-[5-(5-nitro-1,3-dioxo-1,3-dihydro-isoindol-2-yl)-pentyl]-amino}-methyl)-phenyl ester
TypeSmall organic molecule
Emp. Form.C24H28N4O6
Mol. Mass.468.5023
SMILESCCN(CCCCCN1C(=O)c2ccc(cc2C1=O)[N+]([O-])=O)Cc1cccc(OC(=O)NC)c1