Reaction Details
TargetAcetylcholinesterase
LigandBDBM50037176
Substrate/Competitorn/a
Meas. Tech.ChEMBL_29233 (CHEMBL641567)
IC50 7.7±n/a nM
Citation Yamamoto, YIshihara, YKuntz, ID Docking analysis of a series of benzylamino acetylcholinesterase inhibitors with a phthalimide, benzoyl, or indanone moiety. J Med Chem37:3141-53 (1994) Acetylcholinesterase
Name:Acetylcholinesterase
Type:Enzyme
Mol. Mass.:68193.62
Organism:Rattus norvegicus (rat)
Description:P37136
Residue:614
BDBM50037176
NameBDBM50037176
Synonyms:(2S)-2-[(1-benzylpiperidin-4-yl)methyl]-5,6-dimethoxyindan-1-one CHEMBL108726 | DONEPEZIL
TypeSmall organic molecule
Emp. Form.C24H29NO3
Mol. Mass.379.492
SMILESCOc1cc2C[C@H](CC3CCN(Cc4ccccc4)CC3)C(=O)c2cc1OC