Reaction Details
TargetNeutrophil elastase
LigandBDBM50037326
Substrate/Competitorn/a
Meas. Tech.ChEMBL_64134 (CHEMBL676742)
Ki 32±n/a nM
Citation Damewood, JREdwards, PDFeeney, SGomes, BCSteelman, GBTuthill, PAWilliams, JCWarner, PWoolson, SAWolanin, DJ Nonpeptidic inhibitors of human leukocyte elastase. 2. Design, synthesis, and in vitro activity of a series of 3-amino-6-arylopyridin-2-one trifluoromethyl ketones. J Med Chem37:3303-12 (1994) Neutrophil elastase
Name:Neutrophil elastase
Type:Enzyme
Mol. Mass.:28532.38
Organism:Homo sapiens (Human)
Description:P08246
Residue:267
BDBM50037326
NameBDBM50037326
Synonyms:3-{5-Benzyloxycarbonylamino-6-oxo-1-[(3,3,3-trifluoro-1-isopropyl-2-oxo-propylcarbamoyl)-methyl]-1,6-dihydro-pyridin-2-yl}-benzoic acid | CHEMBL325873
TypeSmall organic molecule
Emp. Form.C28H26F3N3O7
Mol. Mass.573.5171
SMILESCC(C)C(NC(=O)Cn1c(ccc(NC(=O)OCc2ccccc2)c1=O)-c1cccc(c1)C(O)=O)C(=O)C(F)(F)F