Reaction Details
TargetNeutrophil elastase
LigandBDBM50036058
Substrate/Competitorn/a
Meas. Tech.ChEMBL_63836 (CHEMBL674886)
Ki 2.5±n/a nM
Citation Bernstein, PRAndisik, DBradley, PKBryant, CBCeccarelli, CDamewood, JREarley, REdwards, PDFeeney, SGomes, BC Nonpeptidic inhibitors of human leukocyte elastase. 3. Design, synthesis, X-ray crystallographic analysis, and structure-activity relationships for a series of orally active 3-amino-6-phenylpyridin-2-one trifluoromethyl ketones. J Med Chem37:3313-26 (1994) Neutrophil elastase
Name:Neutrophil elastase
Type:Enzyme
Mol. Mass.:28532.38
Organism:Homo sapiens (Human)
Description:P08246
Residue:267
BDBM50036058
NameBDBM50036058
Synonyms:CHEMBL354883 {(S)-2-Methyl-1-[(S)-2-((S)-3,3,3-trifluoro-1-isopropyl-2-oxo-propylcarbamoyl)-pyrrolidine-1-carbonyl]-propyl}-carbamic acid benzyl ester
TypeSmall organic molecule
Emp. Form.C24H32F3N3O5
Mol. Mass.499.5232
SMILESCC(C)[C@H](NC(=O)OCc1ccccc1)C(=O)N1CCC[C@H]1C(=O)N[C@@H](C(C)C)C(=O)C(F)(F)F