Reaction Details
TargetNeutrophil elastase
LigandBDBM50037364
Substrate/Competitorn/a
Meas. Tech.ChEMBL_63836 (CHEMBL674886)
Ki 4.1±n/a nM
Citation Bernstein, PRAndisik, DBradley, PKBryant, CBCeccarelli, CDamewood, JREarley, REdwards, PDFeeney, SGomes, BC Nonpeptidic inhibitors of human leukocyte elastase. 3. Design, synthesis, X-ray crystallographic analysis, and structure-activity relationships for a series of orally active 3-amino-6-phenylpyridin-2-one trifluoromethyl ketones. J Med Chem37:3313-26 (1994) Neutrophil elastase
Name:Neutrophil elastase
Type:Enzyme
Mol. Mass.:28532.38
Organism:Homo sapiens (Human)
Description:P08246
Residue:267
BDBM50037364
NameBDBM50037364
Synonyms:CHEMBL113187 | {2-Oxo-6-phenyl-1-[(3,3,3-trifluoro-1-isopropyl-2-oxo-propylcarbamoyl)-methyl]-1,2-dihydro-pyridin-3-yl}-carbamic acid 2,6-dimethyl-pyridin-4-ylmethyl ester
TypeSmall organic molecule
Emp. Form.C28H29F3N4O5
Mol. Mass.558.5489
SMILESCC(C)C(NC(=O)Cn1c(ccc(NC(=O)OCc2cc(C)nc(C)c2)c1=O)-c1ccccc1)C(=O)C(F)(F)F