Reaction Details
TargetLeukotriene B4 receptor 1
LigandBDBM50037388
Substrate/Competitorn/a
Meas. Tech.ChEMBL_99829 (CHEMBL709859)
Ki 112±n/a nM
Citation Daines, RAChambers, PAEggleston, DSFoley, JJGriswold, DEHaltiwanger, RCJakas, DRKingsbury, WDMartin, LDPendrak, I (E)-3-[[[[6-(2-carboxyethenyl)-5-[[8-(4- methoxyphenyl)octyl]oxy]-2-pyridinyl]-methyl]thio]methyl]benzoic acid and related compounds: high affinity leukotriene B4 receptor antagonists. J Med Chem37:3327-36 (1994) Leukotriene B4 receptor 1
Name:Leukotriene B4 receptor 1
Type:Enzyme Catalytic Domain
Mol. Mass.:37582.68
Organism:Homo sapiens (Human)
Description:Q15722
Residue:352
BDBM50037388
NameBDBM50037388
Synonyms:2-{6-((E)-2-Carboxy-vinyl)-5-[8-(4-methoxy-phenyl)-octyloxy]-pyridin-2-ylmethylsulfanylmethyl}-benzoic acid | CHEMBL420488
TypeSmall organic molecule
Emp. Form.C32H37NO6S
Mol. Mass.563.704
SMILESCOc1ccc(CCCCCCCCOc2ccc(CSCc3ccccc3C(O)=O)nc2\C=C\C(O)=O)cc1