Reaction Details
TargetNeuropeptide FF receptor 2
LigandBDBM50037563
Substrate/Competitorn/a
Meas. Tech.ChEMBL_143663 (CHEMBL755904)
Ki 0.5±n/a nM
Citation Gicquel, SMazarguil, HDesprat, CAllard, MDevillers, JPSimonnet, GZajac, JM Structure-activity study of neuropeptide FF: contribution of N-terminal regions to affinity and activity. J Med Chem37:3477-81 (1994) Neuropeptide FF receptor 2
Name:Neuropeptide FF receptor 2
Type:Enzyme Catalytic Domain
Mol. Mass.:47725.66
Organism:RAT
Description:NPFF2 0 RAT::Q9EQD2
Residue:417
BDBM50037563
NameBDBM50037563
Synonyms:2-{[1-(2-{2-[2-(2-Amino-3-(p-hydroxyphenyl)-propionylamino)-4-methyl-pentanoylamino]-3-phenyl-propionylmethylamino}-4-carbamoyl-butyryl)-pyrrolidine-2-carbonyl]-amino}-pentanedioic acid 5-amide 1-{[1-(1-carbamoyl-2-phenyl-ethylcarbamoyl)-4-guanidino-butyl]-amide} | CHEMBL410577
TypeSmall organic molecule
Emp. Form.C54H76N14O11
Mol. Mass.1097.2684
SMILESCC(C)C[C@@H](NC(=O)[C@H](N)Cc1ccc(O)cc1)C(=O)N[C@@H](Cc1ccccc1)C(=O)N[C@@H](CCC(N)=O)C(=O)N1CCC[C@H]1C(=O)N[C@@H](CCC(N)=O)C(=O)N[C@@H](CCCNC(N)=N)C(=O)N[C@@H](Cc1ccccc1)C(N)=O