Reaction Details
TargetKappa-type opioid receptor
LigandBDBM50037577
Substrate/Competitorn/a
Meas. Tech.ChEMBL_145564 (CHEMBL752653)
Ki 7.6±n/a nM
Citation Giardina, GClarke, GDDondio, GPetrone, GSbacchi, MVecchietti, V Selective kappa-opioid agonists: synthesis and structure-activity relationships of piperidines incorporating on oxo-containing acyl group. J Med Chem37:3482-91 (1994) Kappa-type opioid receptor
Name:Kappa-type opioid receptor
Type:Enzyme
Mol. Mass.:42656.78
Organism:Mus musculus (Mouse)
Description:P33534
Residue:380
BDBM50037577
NameBDBM50037577
Synonyms:6-[2-Oxo-2-((S)-2-pyrrolidin-1-ylmethyl-piperidin-1-yl)-ethyl]-3,4-dihydro-2H-naphthalen-1-one | CHEMBL116262
TypeSmall organic molecule
Emp. Form.C22H30N2O2
Mol. Mass.354.4858
SMILESO=C(Cc1ccc2C(=O)CCCc2c1)N1CCCC[C@H]1CN1CCCC1