Reaction Details
TargetKappa-type opioid receptor
LigandBDBM50007164
Substrate/Competitorn/a
Meas. Tech.ChEMBL_145564 (CHEMBL752653)
Ki 0.64±n/a nM
Citation Giardina, GClarke, GDDondio, GPetrone, GSbacchi, MVecchietti, V Selective kappa-opioid agonists: synthesis and structure-activity relationships of piperidines incorporating on oxo-containing acyl group. J Med Chem37:3482-91 (1994) Kappa-type opioid receptor
Name:Kappa-type opioid receptor
Type:Enzyme
Mol. Mass.:42656.78
Organism:Mus musculus (Mouse)
Description:P33534
Residue:380
BDBM50007164
NameBDBM50007164
Synonyms:(S)-1-(2-Pyrrolidin-1-ylmethyl-piperidin-1-yl)-2-(4-trifluoromethyl-phenyl)-ethanone(BRL 52656) 1-(2-Pyrrolidin-1-ylmethyl-piperidin-1-yl)-2-(4-trifluoromethyl-phenyl)-ethanone CHEMBL433508
TypeSmall organic molecule
Emp. Form.C19H25F3N2O
Mol. Mass.354.4098
SMILESFC(F)(F)c1ccc(CC(=O)N2CCCC[C@H]2CN2CCCC2)cc1