Reaction Details
TargetKappa-type opioid receptor
LigandBDBM50037584
Substrate/Competitorn/a
Meas. Tech.ChEMBL_145564 (CHEMBL752653)
Ki 34.8±n/a nM
Citation Giardina, GClarke, GDDondio, GPetrone, GSbacchi, MVecchietti, V Selective kappa-opioid agonists: synthesis and structure-activity relationships of piperidines incorporating on oxo-containing acyl group. J Med Chem37:3482-91 (1994) Kappa-type opioid receptor
Name:Kappa-type opioid receptor
Type:Enzyme
Mol. Mass.:42656.78
Organism:Mus musculus (Mouse)
Description:P33534
Residue:380
BDBM50037584
NameBDBM50037584
Synonyms:6-(2-{(S)-2-[(Cyclobutyl-methyl-amino)-methyl]-piperidin-1-yl}-2-oxo-ethyl)-3,4-dihydro-2H-naphthalen-1-one | CHEMBL331716
TypeSmall organic molecule
Emp. Form.C23H32N2O2
Mol. Mass.368.5124
SMILESCN(C[C@@H]1CCCCN1C(=O)Cc1ccc2C(=O)CCCc2c1)C1CCC1