Reaction Details
TargetKappa-type opioid receptor
LigandBDBM50037590
Substrate/Competitorn/a
Meas. Tech.ChEMBL_145564 (CHEMBL752653)
Ki 7.93±n/a nM
Citation Giardina, GClarke, GDDondio, GPetrone, GSbacchi, MVecchietti, V Selective kappa-opioid agonists: synthesis and structure-activity relationships of piperidines incorporating on oxo-containing acyl group. J Med Chem37:3482-91 (1994) Kappa-type opioid receptor
Name:Kappa-type opioid receptor
Type:Enzyme
Mol. Mass.:42656.78
Organism:Mus musculus (Mouse)
Description:P33534
Residue:380
BDBM50037590
NameBDBM50037590
Synonyms:5-[2-Oxo-2-((S)-2-pyrrolidin-1-ylmethyl-piperidin-1-yl)-ethyl]-indan-1-one | CHEMBL332390
TypeSmall organic molecule
Emp. Form.C21H28N2O2
Mol. Mass.340.4592
SMILESO=C(Cc1ccc2C(=O)CCc2c1)N1CCCC[C@H]1CN1CCCC1