Reaction Details
TargetSterol O-acyltransferase 1
LigandBDBM50037624
Substrate/Competitorn/a
Meas. Tech.ChEMBL_28496 (CHEMBL645926)
IC50 30±n/a nM
Citation Higley, CAWilde, RGMaduskuie, TPJohnson, ALPennev, PBillheimer, JTRobinson, CSGillies, PJWexler, RR Acyl CoA:cholesterol acyltransferase (ACAT) inhibitors: synthesis and structure-activity relationship studies of a new series of trisubstituted imidazoles. J Med Chem37:3511-22 (1994) Sterol O-acyltransferase 1
Name:Sterol O-acyltransferase 1
Type:PROTEIN
Mol. Mass.:64165.56
Organism:Rattus norvegicus
Description:ChEMBL_28796
Residue:545
BDBM50037624
NameBDBM50037624
Synonyms:3-(2,4-Difluoro-phenyl)-1-[5-(4,5-diphenyl-1H-imidazol-2-ylsulfanyl)-pentyl]-1-(3-phenyl-propyl)-urea | CHEMBL116093
TypeSmall organic molecule
Emp. Form.C36H36F2N4OS
Mol. Mass.610.759
SMILESFc1ccc(NC(=O)N(CCCCCSc2nc(c([nH]2)-c2ccccc2)-c2ccccc2)CCCc2ccccc2)c(F)c1