Reaction Details
TargetSterol O-acyltransferase 1
LigandBDBM50037633
Substrate/Competitorn/a
Meas. Tech.ChEMBL_28496 (CHEMBL645926)
IC50 50±n/a nM
Citation Higley, CAWilde, RGMaduskuie, TPJohnson, ALPennev, PBillheimer, JTRobinson, CSGillies, PJWexler, RR Acyl CoA:cholesterol acyltransferase (ACAT) inhibitors: synthesis and structure-activity relationship studies of a new series of trisubstituted imidazoles. J Med Chem37:3511-22 (1994) Sterol O-acyltransferase 1
Name:Sterol O-acyltransferase 1
Type:PROTEIN
Mol. Mass.:64165.56
Organism:Rattus norvegicus
Description:ChEMBL_28796
Residue:545
BDBM50037633
NameBDBM50037633
Synonyms:CHEMBL333653 | [5-(4,5-Diphenyl-1H-imidazol-2-ylsulfanyl)-pentyl]-heptyl-carbamic acid cyclohexyl ester
TypeSmall organic molecule
Emp. Form.C34H47N3O2S
Mol. Mass.561.821
SMILESCCCCCCCN(CCCCCSc1nc(c([nH]1)-c1ccccc1)-c1ccccc1)C(=O)OC1CCCCC1