Reaction Details
TargetD(3) dopamine receptor
LigandBDBM50048299
Substrate/Competitorn/a
Meas. Tech.ChEMBL_62427 (CHEMBL674831)
Ki 17±n/a nM
Citation Wright, JLCaprathe, BWDowning, DMGlase, SAHeffner, TGJaen, JCJohnson, SJKesten, SRMacKenzie, RGMeltzer, LT The discovery and structure-activity relationships of 1,2,3,6-tetrahydro-4-phenyl-1-[(arylcyclohexenyl)alkyl]pyridines. Dopamine autoreceptor agonists and potential antipsychotic agents. J Med Chem37:3523-33 (1994) D(3) dopamine receptor
Name:D(3) dopamine receptor
Type:n/a
Mol. Mass.:44243.43
Organism:Homo sapiens (Human)
Description:n/a
Residue:400
BDBM50048299
NameBDBM50048299
Synonyms:4-Phenyl-1-((R)-3-phenyl-cyclohex-3-enylmethyl)-1,2,3,6-tetrahydro-pyridine CI-1007
TypeSmall organic molecule
Emp. Form.C24H27N
Mol. Mass.329.4779
SMILESC([C@@H]1CCC=C(C1)c1ccccc1)N1CCC(=CC1)c1ccccc1