Reaction Details
TargetD(2) dopamine receptor
LigandBDBM50037669
Substrate/Competitorn/a
Meas. Tech.ChEMBL_61753 (CHEMBL676060)
IC50 76±n/a nM
Citation Wright, JLCaprathe, BWDowning, DMGlase, SAHeffner, TGJaen, JCJohnson, SJKesten, SRMacKenzie, RGMeltzer, LT The discovery and structure-activity relationships of 1,2,3,6-tetrahydro-4-phenyl-1-[(arylcyclohexenyl)alkyl]pyridines. Dopamine autoreceptor agonists and potential antipsychotic agents. J Med Chem37:3523-33 (1994) D(2) dopamine receptor
Name:D(2) dopamine receptor
Type:G Protein-Coupled Receptor (GPCR)
Mol. Mass.:50931.60
Organism:Rattus norvegicus (rat)
Description:P61169
Residue:444
BDBM50037669
NameBDBM50037669
Synonyms:1-[(R)-3-(4-Fluoro-phenyl)-cyclohex-3-enylmethyl]-4-phenyl-1,2,3,6-tetrahydro-pyridine | CHEMBL118219
TypeSmall organic molecule
Emp. Form.C24H26FN
Mol. Mass.347.4683
SMILESFc1ccc(cc1)C1=CCC[C@@H](CN2CCC(=CC2)c2ccccc2)C1