Reaction Details
TargetD(2) dopamine receptor
LigandBDBM50037674
Substrate/Competitorn/a
Meas. Tech.ChEMBL_61753 (CHEMBL676060)
IC50 141±n/a nM
Citation Wright, JLCaprathe, BWDowning, DMGlase, SAHeffner, TGJaen, JCJohnson, SJKesten, SRMacKenzie, RGMeltzer, LT The discovery and structure-activity relationships of 1,2,3,6-tetrahydro-4-phenyl-1-[(arylcyclohexenyl)alkyl]pyridines. Dopamine autoreceptor agonists and potential antipsychotic agents. J Med Chem37:3523-33 (1994) D(2) dopamine receptor
Name:D(2) dopamine receptor
Type:G Protein-Coupled Receptor (GPCR)
Mol. Mass.:50931.60
Organism:Rattus norvegicus (rat)
Description:P61169
Residue:444
BDBM50037674
NameBDBM50037674
Synonyms:1-(3-Phenyl-cyclohex-3-enylmethyl)-4-pyridin-2-yl-piperazine | CHEMBL116205
TypeSmall organic molecule
Emp. Form.C22H27N3
Mol. Mass.333.4699
SMILESC(C1CCC=C(C1)c1ccccc1)N1CCN(CC1)c1ccccn1