Reaction Details
TargetGag-Pol polyprotein [489-587]
LigandBDBM50037830
Substrate/Competitorn/a
Meas. Tech.ChEMBL_159307 (CHEMBL769360)
IC50 450±n/a nM
Citation Kitchin, JBethell, RCCammack, NDolan, SEvans, DNHolman, SHolmes, DSMcMeekin, PMo, CLNieland, N Synthesis and structure-activity relationships of a series of penicillin-derived HIV proteinase inhibitors: heterocyclic ring systems containing P1' and P2' substituents. J Med Chem37:3707-16 (1994) Gag-Pol polyprotein [489-587]
Name:Gag-Pol polyprotein [489-587]
Type:Enzyme Subunit
Mol. Mass.:10781.16
Organism:Human immunodeficiency virus type 1
Description:P04585[489-587]
Residue:99
BDBM50037830
NameBDBM50037830
Synonyms:(2R,4S)-2-[Benzylcarbamoyl-((S)-phenylacetylamino)-methyl]-5,5-dimethyl-thiazolidine-4-carboxylic acid [3-((R)-4-tert-butylcarbamoyl-thiazolidin-3-yl)-2-hydroxy-propyl]-amide | CHEMBL331645
TypeSmall organic molecule
Emp. Form.C34H48N6O5S2
Mol. Mass.684.912
SMILESCC(C)(C)NC(=O)[C@@H]1CSCN1CC(O)CNC(=O)[C@@H]1N[C@H](SC1(C)C)C(NC(=O)Cc1ccccc1)C(=O)NCc1ccccc1