Reaction Details
TargetMuscarinic acetylcholine receptor M2
LigandBDBM50018298
Substrate/Competitorn/a
Meas. Tech.ChEMBL_140105 (CHEMBL748286)
IC50 100±n/a nM
Citation Burke, BJDunn, WJHopfinger, AJ Construction of a molecular shape analysis-three-dimensional quantitative structure-analysis relationship for an analog series of pyridobenzodiazepinone inhibitors of muscarinic 2 and 3 receptors. J Med Chem37:3775-88 (1994) Muscarinic acetylcholine receptor M2
Name:Muscarinic acetylcholine receptor M2
Type:Enzyme Catalytic Domain
Mol. Mass.:51555.53
Organism:RAT
Description:P10980
Residue:466
BDBM50018298
NameBDBM50018298
Synonyms:11-(2-{2-[(Butyl-methyl-amino)-methyl]-piperidin-1-yl}-acetyl)-5,11-dihydro-benzo[e]pyrido[3,2-b][1,4]diazepin-6-one | CHEMBL300660
TypeSmall organic molecule
Emp. Form.C25H33N5O2
Mol. Mass.435.5618
SMILESCCCCN(C)CC1CCCCN1CC(=O)N1c2ccccc2C(=O)Nc2cccnc12