Reaction Details
TargetCholecystokinin receptor type A
LigandBDBM50037856
Substrate/Competitorn/a
Meas. Tech.ChEMBL_49715 (CHEMBL661792)
IC50 72±n/a nM
Citation Lowe, JAHageman, DLDrozda, SEMcLean, SBryce, DKCrawford, RTZorn, SMorrone, JBordner, J 5-Phenyl-3-ureidobenzazepin-2-ones as cholecystokinin-B receptor antagonists. J Med Chem37:3789-811 (1994) Cholecystokinin receptor type A
Name:Cholecystokinin receptor type A
Type:n/a
Mol. Mass.:48229.77
Organism:Cavia porcellus
Description:n/a
Residue:430
BDBM50037856
NameBDBM50037856
Synonyms:CHEMBL339547 | N-tert-Butyl-2-{(3R,5R)-3-[3-(3-chloro-phenyl)-ureido]-5-isopropyl-8-methyl-2-oxo-2,3,4,5-tetrahydro-benzo[b]azepin-1-yl}-acetamide
TypeSmall organic molecule
Emp. Form.C27H35ClN4O3
Mol. Mass.499.045
SMILESCC(C)[C@H]1C[C@@H](NC(=O)Nc2cccc(Cl)c2)C(=O)N(CC(=O)NC(C)(C)C)c2cc(C)ccc12