Reaction Details
TargetGastrin/cholecystokinin type B receptor
LigandBDBM50037865
Substrate/Competitorn/a
Meas. Tech.ChEMBL_47965 (CHEMBL653979)
IC50 7.6±n/a nM
Citation Lowe, JAHageman, DLDrozda, SEMcLean, SBryce, DKCrawford, RTZorn, SMorrone, JBordner, J 5-Phenyl-3-ureidobenzazepin-2-ones as cholecystokinin-B receptor antagonists. J Med Chem37:3789-811 (1994) Gastrin/cholecystokinin type B receptor
Name:Gastrin/cholecystokinin type B receptor
Type:G Protein-Coupled Receptor (GPCR)
Mol. Mass.:48445.79
Organism:Homo sapiens (Human)
Description:Stable expression of human CCK-2 receptors in HEK 293 cells.
Residue:447
BDBM50037865
NameBDBM50037865
Synonyms:2-{(3R,5R)-3-[3-(3-Chloro-phenyl)-ureido]-2-oxo-5-phenyl-2,3,4,5-tetrahydro-benzo[b]azepin-1-yl}-N-(1,1-dimethyl-propyl)-acetamide | CHEMBL123951
TypeSmall organic molecule
Emp. Form.C30H33ClN4O3
Mol. Mass.533.061
SMILESCCC(C)(C)NC(=O)CN1c2ccccc2[C@H](C[C@@H](NC(=O)Nc2cccc(Cl)c2)C1=O)c1ccccc1