Reaction Details
TargetProstaglandin G/H synthase 2
LigandBDBM50029623
Substrate/Competitorn/a
Meas. Tech.ChEMBL_159928 (CHEMBL769653)
IC50 3±n/a nM
Citation Reitz, DBLi, JJNorton, MBReinhard, EJCollins, JTAnderson, GDGregory, SAKoboldt, CMPerkins, WESeibert, K Selective cyclooxygenase inhibitors: novel 1,2-diarylcyclopentenes are potent and orally active COX-2 inhibitors. J Med Chem37:3878-81 (1994) Prostaglandin G/H synthase 2
Name:Prostaglandin G/H synthase 2
Type:Enzyme
Mol. Mass.:69003.89
Organism:Homo sapiens (Human)
Description:Recombinant Cox-2 provided by Cayman (Cayman Chemical Co.,Ann Arbor, MI).
Residue:604
BDBM50029623
NameBDBM50029623
Synonyms:1-chloro-4-[2-(4-methylsulfonylphenyl)-1-cyclopentenyl]benzene | CHEMBL340573
TypeSmall organic molecule
Emp. Form.C18H17ClO2S
Mol. Mass.332.844
SMILESCS(=O)(=O)c1ccc(cc1)C1=C(CCC1)c1ccc(Cl)cc1