Reaction Details
TargetMuscarinic acetylcholine receptor M1
LigandBDBM50038219
Substrate/Competitorn/a
Meas. Tech.ChEMBL_139963 (CHEMBL749018)
Ki 35±n/a nM
Citation Moltzen, EKPedersen, HBøgesø, KPMeier, EFrederiksen, KSánchez, CLøve Lembøl, H Bioisosteres of arecoline: 1,2,3,6-tetrahydro-5-pyridyl-substituted and 3-piperidyl-substituted derivatives of tetrazoles and 1,2,3-triazoles. Synthesis and muscarinic activity. J Med Chem37:4085-99 (1995) Muscarinic acetylcholine receptor M1
Name:Muscarinic acetylcholine receptor M1
Type:Enzyme Catalytic Domain
Mol. Mass.:51390.46
Organism:RAT
Description:P08482
Residue:460
BDBM50038219
NameBDBM50038219
Synonyms:1-Methyl-5-(2-methyl-2H-[1,2,3]triazol-4-yl)-1,2,3,6-tetrahydro-pyridine | CHEMBL129886
TypeSmall organic molecule
Emp. Form.C9H14N4
Mol. Mass.178.2343
SMILESCN1CCC=C(C1)c1cnn(C)n1