Reaction Details
TargetMuscarinic acetylcholine receptor M1
LigandBDBM50038213
Substrate/Competitorn/a
Meas. Tech.ChEMBL_139963 (CHEMBL749018)
Ki 170±n/a nM
Citation Moltzen, EKPedersen, HBøgesø, KPMeier, EFrederiksen, KSánchez, CLøve Lembøl, H Bioisosteres of arecoline: 1,2,3,6-tetrahydro-5-pyridyl-substituted and 3-piperidyl-substituted derivatives of tetrazoles and 1,2,3-triazoles. Synthesis and muscarinic activity. J Med Chem37:4085-99 (1995) Muscarinic acetylcholine receptor M1
Name:Muscarinic acetylcholine receptor M1
Type:Enzyme Catalytic Domain
Mol. Mass.:51390.46
Organism:RAT
Description:P08482
Residue:460
BDBM50038213
NameBDBM50038213
Synonyms:3-(2-Allyl-2H-[1,2,3]triazol-4-yl)-piperidine | CHEMBL131777
TypeSmall organic molecule
Emp. Form.C10H16N4
Mol. Mass.192.2608
SMILESC=CCn1ncc(n1)C1CCCNC1