Reaction Details
TargetD(1A) dopamine receptor
LigandBDBM50038344
Substrate/Competitorn/a
Meas. Tech.ChEMBL_61342 (CHEMBL879549)
Ki 290±n/a nM
Citation Minor, DLWyrick, SDCharifson, PSWatts, VJNichols, DEMailman, RB Synthesis and molecular modeling of 1-phenyl-1,2,3,4-tetrahydroisoquinolines and related 5,6,8,9-tetrahydro-13bH-dibenzo[a,h]quinolizines as D1 dopamine antagonists. J Med Chem37:4317-28 (1995) D(1A) dopamine receptor
Name:D(1A) dopamine receptor
Type:Enzyme Catalytic Domain
Mol. Mass.:49429.75
Organism:RAT
Description:P18901
Residue:446
BDBM50038344
NameBDBM50038344
Synonyms:2-Methyl-1-phenyl-1,2,3,4-tetrahydro-isoquinoline-6,7-diol | CHEMBL135318
TypeSmall organic molecule
Emp. Form.C16H17NO2
Mol. Mass.255.3117
SMILESCN1CCc2cc(O)c(O)cc2C1c1ccccc1