Reaction Details
TargetD(1A) dopamine receptor
LigandBDBM50022056
Substrate/Competitorn/a
Meas. Tech.ChEMBL_61342 (CHEMBL879549)
Ki 1900±n/a nM
Citation Minor, DLWyrick, SDCharifson, PSWatts, VJNichols, DEMailman, RB Synthesis and molecular modeling of 1-phenyl-1,2,3,4-tetrahydroisoquinolines and related 5,6,8,9-tetrahydro-13bH-dibenzo[a,h]quinolizines as D1 dopamine antagonists. J Med Chem37:4317-28 (1995) D(1A) dopamine receptor
Name:D(1A) dopamine receptor
Type:Enzyme Catalytic Domain
Mol. Mass.:49429.75
Organism:RAT
Description:P18901
Residue:446
BDBM50022056
NameBDBM50022056
Synonyms:6-Chloro-1-phenyl-2-propyl-1,2,3,4-tetrahydro-isoquinolin-7-ol | CHEMBL300778
TypeSmall organic molecule
Emp. Form.C18H20ClNO
Mol. Mass.301.811
SMILESCCCN1CCc2cc(Cl)c(O)cc2C1c1ccccc1