Reaction Details
Target5-hydroxytryptamine receptor 2A
LigandBDBM50038689
Substrate/Competitorn/a
Meas. Tech.ChEMBL_2497 (CHEMBL617384)
Ki 10±n/a nM
Citation Glennon, RADukat, Mel-Bermawy, MLaw, HDe los Angeles, JTeitler, MKing, AHerrick-Davis, K Influence of amine substituents on 5-HT2A versus 5-HT2C binding of phenylalkyl- and indolylalkylamines. J Med Chem37:1929-35 (1994) 5-hydroxytryptamine receptor 2A
Name:5-hydroxytryptamine receptor 2A
Type:undefined
Mol. Mass.:52607.65
Organism:Homo sapiens (Human)
Description:P28223
Residue:471
BDBM50038689
NameBDBM50038689
Synonyms:CHEMBL60757 | [2-(5-Methoxy-1H-indol-3-yl)-ethyl]-(3-phenyl-propyl)-amine
TypeSmall organic molecule
Emp. Form.C20H24N2O
Mol. Mass.308.4174
SMILESCOc1ccc2[nH]cc(CCNCCCc3ccccc3)c2c1