Reaction Details
Target5-hydroxytryptamine receptor 2A
LigandBDBM50038665
Substrate/Competitorn/a
Meas. Tech.ChEMBL_2497 (CHEMBL617384)
Ki 0.4±n/a nM
Citation Glennon, RADukat, Mel-Bermawy, MLaw, HDe los Angeles, JTeitler, MKing, AHerrick-Davis, K Influence of amine substituents on 5-HT2A versus 5-HT2C binding of phenylalkyl- and indolylalkylamines. J Med Chem37:1929-35 (1994) 5-hydroxytryptamine receptor 2A
Name:5-hydroxytryptamine receptor 2A
Type:undefined
Mol. Mass.:52607.65
Organism:Homo sapiens (Human)
Description:P28223
Residue:471
BDBM50038665
NameBDBM50038665
Synonyms:CHEMBL57939 | [2-(4-Bromo-2,5-dimethoxy-phenyl)-ethyl]-(4-iodo-benzyl)-amine
TypeSmall organic molecule
Emp. Form.C17H19BrINO2
Mol. Mass.476.147
SMILESCOc1cc(CCNCc2ccc(I)cc2)c(OC)cc1Br