Reaction Details
Target5-hydroxytryptamine receptor 2A
LigandBDBM50038675
Substrate/Competitorn/a
Meas. Tech.ChEMBL_2498 (CHEMBL617385)
Ki 1.6±n/a nM
Citation Glennon, RADukat, Mel-Bermawy, MLaw, HDe los Angeles, JTeitler, MKing, AHerrick-Davis, K Influence of amine substituents on 5-HT2A versus 5-HT2C binding of phenylalkyl- and indolylalkylamines. J Med Chem37:1929-35 (1994) 5-hydroxytryptamine receptor 2A
Name:5-hydroxytryptamine receptor 2A
Type:undefined
Mol. Mass.:52607.65
Organism:Homo sapiens (Human)
Description:P28223
Residue:471
BDBM50038675
NameBDBM50038675
Synonyms:(4-Bromo-benzyl)-[2-(4-bromo-2,5-dimethoxy-phenyl)-ethyl]-amine | CHEMBL294902
TypeSmall organic molecule
Emp. Form.C17H19Br2NO2
Mol. Mass.429.146
SMILESCOc1cc(CCNCc2ccc(Br)cc2)c(OC)cc1Br