Reaction Details
Target5-hydroxytryptamine receptor 2C
LigandBDBM50038678
Substrate/Competitorn/a
Meas. Tech.ChEMBL_2842 (CHEMBL621527)
Ki 100±n/a nM
Citation Glennon, RADukat, Mel-Bermawy, MLaw, HDe los Angeles, JTeitler, MKing, AHerrick-Davis, K Influence of amine substituents on 5-HT2A versus 5-HT2C binding of phenylalkyl- and indolylalkylamines. J Med Chem37:1929-35 (1994) 5-hydroxytryptamine receptor 2C
Name:5-hydroxytryptamine receptor 2C
Type:Enzyme
Mol. Mass.:51935.10
Organism:Rattus norvegicus (Rat)
Description:P08909
Residue:460
BDBM50038678
NameBDBM50038678
Synonyms:CHEMBL57000 | [2-(4-Bromo-2,5-dimethoxy-phenyl)-ethyl]-methyl-amine
TypeSmall organic molecule
Emp. Form.C11H16BrNO2
Mol. Mass.274.154
SMILESCNCCc1cc(OC)c(Br)cc1OC