Reaction Details
Target5-hydroxytryptamine receptor 2A
LigandBDBM50038663
Substrate/Competitorn/a
Meas. Tech.ChEMBL_2497 (CHEMBL617384)
Ki 30±n/a nM
Citation Glennon, RADukat, Mel-Bermawy, MLaw, HDe los Angeles, JTeitler, MKing, AHerrick-Davis, K Influence of amine substituents on 5-HT2A versus 5-HT2C binding of phenylalkyl- and indolylalkylamines. J Med Chem37:1929-35 (1994) 5-hydroxytryptamine receptor 2A
Name:5-hydroxytryptamine receptor 2A
Type:undefined
Mol. Mass.:52607.65
Organism:Homo sapiens (Human)
Description:P28223
Residue:471
BDBM50038663
NameBDBM50038663
Synonyms:CHEMBL294216 | [2-(5-Methoxy-1H-indol-3-yl)-ethyl]-(4-methyl-benzyl)-amine
TypeSmall organic molecule
Emp. Form.C19H22N2O
Mol. Mass.294.3908
SMILESCOc1ccc2[nH]cc(CCNCc3ccc(C)cc3)c2c1