Reaction Details
Target5-hydroxytryptamine receptor 2A
LigandBDBM50005267
Substrate/Competitorn/a
Meas. Tech.ChEMBL_2497 (CHEMBL617384)
Ki 1±n/a nM
Citation Glennon, RADukat, Mel-Bermawy, MLaw, HDe los Angeles, JTeitler, MKing, AHerrick-Davis, K Influence of amine substituents on 5-HT2A versus 5-HT2C binding of phenylalkyl- and indolylalkylamines. J Med Chem37:1929-35 (1994) 5-hydroxytryptamine receptor 2A
Name:5-hydroxytryptamine receptor 2A
Type:undefined
Mol. Mass.:52607.65
Organism:Homo sapiens (Human)
Description:P28223
Residue:471
BDBM50005267
NameBDBM50005267
Synonyms:2,5-dimethoxy-4-bromophenethylamine 2-(4-bromo-2,5-dimethoxyphenyl)ethylamine | CHEMBL292821
TypeSmall organic molecule
Emp. Form.C10H14BrNO2
Mol. Mass.260.128
SMILESCOc1cc(CCN)c(OC)cc1Br