Reaction Details
Target5-hydroxytryptamine receptor 2A
LigandBDBM50038683
Substrate/Competitorn/a
Meas. Tech.ChEMBL_2498 (CHEMBL617385)
Ki 100±n/a nM
Citation Glennon, RADukat, Mel-Bermawy, MLaw, HDe los Angeles, JTeitler, MKing, AHerrick-Davis, K Influence of amine substituents on 5-HT2A versus 5-HT2C binding of phenylalkyl- and indolylalkylamines. J Med Chem37:1929-35 (1994) 5-hydroxytryptamine receptor 2A
Name:5-hydroxytryptamine receptor 2A
Type:undefined
Mol. Mass.:52607.65
Organism:Homo sapiens (Human)
Description:P28223
Residue:471
BDBM50038683
NameBDBM50038683
Synonyms:CHEMBL58555 | [2-(4-Bromo-2,5-dimethoxy-phenyl)-ethyl]-(4-phenyl-butyl)-amine
TypeSmall organic molecule
Emp. Form.C20H26BrNO2
Mol. Mass.392.33
SMILESCOc1cc(CCNCCCCc2ccccc2)c(OC)cc1Br