Reaction Details
TargetAcetylcholinesterase
LigandBDBM50038733
Substrate/Competitorn/a
Meas. Tech.ChEMBL_28303 (CHEMBL645002)
IC50 20±n/a nM
Citation Chen, YLListon, DNielsen, JChapin, DDunaiskis, AHedberg, KIves, JJohnson, JJones, S Syntheses and anticholinesterase activity of tetrahydrobenzazepine carbamates. J Med Chem37:1996-2000 (1994) Acetylcholinesterase
Name:Acetylcholinesterase
Type:Enzyme
Mol. Mass.:67792.70
Organism:Homo sapiens (Human)
Description:P22303
Residue:614
BDBM50038733
NameBDBM50038733
Synonyms:(3aS,8aR)-1-ethyl-3a-methyl-1,2,3,3a,8,8a-hexahydroindeno[2,1-b]pyrrol-5-yl hexylcarbamate Hexyl-carbamic acid (3aS,8aR)-1-ethyl-3a-methyl-1,2,3,3a,8,8a-hexahydro-indeno[2,1-b]pyrrol-5-yl ester
TypeSmall organic molecule
Emp. Form.C21H32N2O2
Mol. Mass.344.491
SMILESCCCCCCNC(=O)Oc1ccc2C[C@H]3N(CC)CC[C@@]3(C)c2c1