Reaction Details
TargetCarbonic anhydrase 2
LigandBDBM50038957
Substrate/Competitorn/a
Meas. Tech.ChEMBL_45051 (CHEMBL658049)
Kd 4.3±n/a nM
Citation Jain, AWhitesides, GMAlexander, RSChristianson, DW Identification of two hydrophobic patches in the active-site cavity of human carbonic anhydrase II by solution-phase and solid-state studies and their use in the development of tight-binding inhibitors. J Med Chem37:2100-5 (1994) Carbonic anhydrase 2
Name:Carbonic anhydrase 2
Type:Enzyme
Mol. Mass.:29250.71
Organism:Homo sapiens (Human)
Description:P00918
Residue:260
BDBM50038957
NameBDBM50038957
Synonyms:CHEMBL65213 | N-Pyridin-2-ylmethyl-4-sulfamoyl-benzamide
TypeSmall organic molecule
Emp. Form.C13H13N3O3S
Mol. Mass.291.326
SMILESNS(=O)(=O)c1ccc(cc1)C(=O)NCc1ccccn1