Reaction Details
TargetCarbonic anhydrase 2
LigandBDBM50038968
Substrate/Competitorn/a
Meas. Tech.ChEMBL_45051 (CHEMBL658049)
Kd 0.6±n/a nM
Citation Jain, AWhitesides, GMAlexander, RSChristianson, DW Identification of two hydrophobic patches in the active-site cavity of human carbonic anhydrase II by solution-phase and solid-state studies and their use in the development of tight-binding inhibitors. J Med Chem37:2100-5 (1994) Carbonic anhydrase 2
Name:Carbonic anhydrase 2
Type:Enzyme
Mol. Mass.:29250.71
Organism:Homo sapiens (Human)
Description:P00918
Residue:260
BDBM50038968
NameBDBM50038968
Synonyms:CHEMBL293626 | N-Naphthalen-1-ylmethyl-4-sulfamoyl-benzamide
TypeSmall organic molecule
Emp. Form.C18H16N2O3S
Mol. Mass.340.396
SMILESNS(=O)(=O)c1ccc(cc1)C(=O)NCc1cccc2ccccc12