Reaction Details
TargetProthrombin
LigandBDBM50039011
Substrate/Competitorn/a
Meas. Tech.ChEMBL_208860 (CHEMBL810934)
IC50 57100±n/a nM
Citation Iwanowicz, EJLau, WFLin, JRoberts, DGSeiler, SM Retro-binding tripeptide thrombin active-site inhibitors: discovery, synthesis, and molecular modeling. J Med Chem37:2122-4 (1994) Prothrombin
Name:Prothrombin
Type:Protein
Mol. Mass.:70029.57
Organism:Homo sapiens (Human)
Description:P00734
Residue:622
BDBM50039011
NameBDBM50039011
Synonyms:(S)-2-{(S)-2-[(S)-2-(5-Amino-pentanoylamino)-3-phenyl-propionylamino]-4-methyl-pentanoylamino}-3-phenyl-propionic acid methyl ester | CHEMBL417058
TypeSmall organic molecule
Emp. Form.C30H42N4O5
Mol. Mass.538.6783
SMILESCOC(=O)[C@H](Cc1ccccc1)NC(=O)[C@H](CC(C)C)NC(=O)[C@H](Cc1ccccc1)NC(=O)CCCCN