Reaction Details
TargetProthrombin
LigandBDBM50039016
Substrate/Competitorn/a
Meas. Tech.ChEMBL_208861 (CHEMBL810935)
IC50 30000±n/a nM
Citation Iwanowicz, EJLau, WFLin, JRoberts, DGSeiler, SM Retro-binding tripeptide thrombin active-site inhibitors: discovery, synthesis, and molecular modeling. J Med Chem37:2122-4 (1994) Prothrombin
Name:Prothrombin
Type:Protein
Mol. Mass.:70029.57
Organism:Homo sapiens (Human)
Description:P00734
Residue:622
BDBM50039016
NameBDBM50039016
Synonyms:(S)-7-Amino-3-{[(S)-1-((R)-2-amino-3-phenyl-propionyl)-pyrrolidine-2-carbonyl]-amino}-2-hydroxy-heptanoic acid methyl ester | CHEMBL68169
TypeSmall organic molecule
Emp. Form.C22H34N4O5
Mol. Mass.434.5292
SMILESCOC(=O)C(O)[C@H](CCCCN)NC(=O)[C@@H]1CCCN1C(=O)[C@H](N)Cc1ccccc1