Reaction Details
TargetProthrombin
LigandBDBM50039010
Substrate/Competitorn/a
Meas. Tech.ChEMBL_208859 (CHEMBL810933)
IC50 120±n/a nM
Citation Iwanowicz, EJLau, WFLin, JRoberts, DGSeiler, SM Retro-binding tripeptide thrombin active-site inhibitors: discovery, synthesis, and molecular modeling. J Med Chem37:2122-4 (1994) Prothrombin
Name:Prothrombin
Type:Protein
Mol. Mass.:70029.57
Organism:Homo sapiens (Human)
Description:P00734
Residue:622
BDBM50039010
NameBDBM50039010
Synonyms:(S)-2-[(S)-2-(4-Guanidino-butyrylamino)-3-phenyl-propionylamino]-4-methyl-pentanoic acid ((1S,2R)-1-cyclohexylmethyl-2-hydroxy-2-thiazol-2-yl-ethyl)-amide | CHEMBL308232
TypeSmall organic molecule
Emp. Form.C32H49N7O4S
Mol. Mass.627.841
SMILESCC(C)C[C@H](NC(=O)[C@H](Cc1ccccc1)NC(=O)CCCNC(N)=N)C(=O)N[C@@H](CC1CCCCC1)[C@@H](O)c1nccs1