Reaction Details
TargetPlatelet-derived growth factor receptor alpha/beta
LigandBDBM50039047
Substrate/Competitorn/a
Meas. Tech.ChEMBL_154725 (CHEMBL763109)
IC50 20±n/a nM
Citation Maguire, MPSheets, KRMcVety, KSpada, APZilberstein, A A new series of PDGF receptor tyrosine kinase inhibitors: 3-substituted quinoline derivatives. J Med Chem37:2129-37 (1994) Platelet-derived growth factor receptor alpha/beta
Name:Platelet-derived growth factor receptor alpha/beta
Type:n/a
Mol. Mass.:n/a
Description:ASSAY_ID of EBI is 29498
Components:This complex has 2 components.
Component 1
Name:Platelet-derived growth factor receptor beta
Synonyms:Beta-type platelet-derived growth factor receptor CD140b antigen PDGF Receptor Substrate PDGFR PDGFR-1 PDGFRB PGFRB_HUMAN Platelet-derived growth factor receptor 1 Platelet-derived growth factor receptor beta (PDGFR-beta) Platelet-derived growth factor receptor beta (PDGFRbeta) | VHL/PDGFRB
Type:Enzyme
Mol. Mass.:123922.25
Organism:Homo sapiens (Human)
Description:P09619
Residue:1106
Component 2
Name:Platelet-derived growth factor receptor alpha
Synonyms:Alpha-type platelet-derived growth factor receptor PDGFRA PGFRA_HUMAN Platelet-derived growth factor receptor alpha (PDGFRA) RHEPDGFRA
Type:Protein
Mol. Mass.:122633.38
Organism:Homo sapiens (Human)
Description:P16234
Residue:1089
BDBM50039047
NameBDBM50039047
Synonyms:5-Fluoro-3-thiophen-3-yl-quinoline | CHEMBL305056
TypeSmall organic molecule
Emp. Form.C13H8FNS
Mol. Mass.229.273
SMILESFc1cccc2ncc(cc12)-c1ccsc1