Reaction Details
TargetEpidermal growth factor receptor
LigandBDBM50039082
Substrate/Competitorn/a
Meas. Tech.ChEMBL_63758 (CHEMBL679946)
IC50>20000±n/a nM
Citation Maguire, MPSheets, KRMcVety, KSpada, APZilberstein, A A new series of PDGF receptor tyrosine kinase inhibitors: 3-substituted quinoline derivatives. J Med Chem37:2129-37 (1994) Epidermal growth factor receptor
Name:Epidermal growth factor receptor
Type:Receptor Kinase Domain
Mol. Mass.:134279.59
Organism:Homo sapiens (Human)
Description:P00533
Residue:1210
BDBM50039082
NameBDBM50039082
Synonyms:6,7-Dimethoxy-3-thiophen-3-yl-quinoline RPR-101511
TypeSmall organic molecule
Emp. Form.C15H13NO2S
Mol. Mass.271.334
SMILESCOc1cc2cc(cnc2cc1OC)-c1ccsc1