Reaction Details
TargetKappa-type opioid receptor
LigandBDBM50000293
Substrate/Competitorn/a
Meas. Tech.ChEMBL_145681 (CHEMBL754277)
IC50 0.1±n/a nM
Citation Naylor, AJudd, DBScopes, DIHayes, AGBirch, PJ 4-[(Alkylamino)methyl]furo[3,2-c]pyridines: a new series of selective kappa-receptor agonists. J Med Chem37:2138-44 (1994) Kappa-type opioid receptor
Name:Kappa-type opioid receptor
Type:G Protein-Coupled Receptor (GPCR)
Mol. Mass.:42648.76
Organism:Homo sapiens (Human)
Description:P41145
Residue:380
BDBM50000293
NameBDBM50000293
Synonyms:2-(3,4-Dichloro-phenyl)-1-(7-pyrrolidin-1-ylmethyl-1,4-dioxa-8-aza-spiro[4.5]dec-8-yl)-ethanone GR-45809
TypeSmall organic molecule
Emp. Form.C20H26Cl2N2O3
Mol. Mass.413.338
SMILESClc1ccc(CC(=O)N2CCC3(CC2CN2CCCC2)OCCO3)cc1Cl