Reaction Details
TargetAromatase
LigandBDBM50332833
Substrate/Competitorn/a
Meas. Tech.ChEMBL_51032 (CHEMBL662245)
Ki 1000±n/a nM
Citation Numazawa, MMutsumi, ATachibana, MHoshi, K Synthesis of androst-5-en-7-ones and androsta-3,5-dien-7-ones and their related 7-deoxy analogs as conformational and catalytic probes for the active site of aromatase. J Med Chem37:2198-205 (1994) Aromatase
Name:Aromatase
Type:Enzyme
Mol. Mass.:57888.92
Organism:Homo sapiens (Human)
Description:P11511
Residue:503
BDBM50332833
NameBDBM50332833
Synonyms:(8R,9S,10S,13S,14S)-10-(hydroxymethyl)-13-methyl-3,4,7,8,9,10,11,12,13,14,15,16-dodecahydro-1H-cyclopenta[a]phenanthren-17(2H)-one | CHEMBL1630911
TypeSmall organic molecule
Emp. Form.C19H28O2
Mol. Mass.288.4244
SMILESC[C@]12CC[C@H]3[C@@H](CC=C4CCCC[C@]34CO)[C@@H]1CCC2=O