Reaction Details
TargetAromatase
LigandBDBM50039160
Substrate/Competitorn/a
Meas. Tech.ChEMBL_51033 (CHEMBL662246)
Ki 140±n/a nM
Citation Numazawa, MMutsumi, ATachibana, MHoshi, K Synthesis of androst-5-en-7-ones and androsta-3,5-dien-7-ones and their related 7-deoxy analogs as conformational and catalytic probes for the active site of aromatase. J Med Chem37:2198-205 (1994) Aromatase
Name:Aromatase
Type:Enzyme
Mol. Mass.:57888.92
Organism:Homo sapiens (Human)
Description:P11511
Residue:503
BDBM50039160
NameBDBM50039160
Synonyms:13-Methyl-1,6,7,8,9,10,11,12,13,14,15,16-dodecahydro-2H-cyclopenta[a]phenanthrene-3,17-dione | CHEMBL309113
TypeSmall organic molecule
Emp. Form.C18H24O2
Mol. Mass.272.382
SMILESCC12CCC3C(CCC4=CC(=O)CCC34)C1CCC2=O