Reaction Details
TargetNeprilysin
LigandBDBM50039514
Substrate/Competitorn/a
Meas. Tech.ChEMBL_144466 (CHEMBL755532)
IC50 11±n/a nM
Citation Neustadt, BRSmith, EMNechuta, TLBronnenkant, AAHaslanger, MFWatkins, RWFoster, CJSybertz, EJ Mercaptoacyl amino acid inhibitors of atriopeptidase. 1. Structure-activity relationship studies of methionine and S-alkylcysteine derivatives. J Med Chem37:2461-76 (1994) Neprilysin
Name:Neprilysin
Type:Enzyme
Mol. Mass.:85570.75
Organism:Oryctolagus cuniculus (rabbit)
Description:NEP was purified to homogeneity from rabbit kidney.
Residue:750
BDBM50039514
NameBDBM50039514
Synonyms:(S)-2-((S)-2-Mercaptomethyl-3-phenyl-propionylamino)-3-(4-methyl-benzylsulfanyl)-propionic acid | CHEMBL81240
TypeSmall organic molecule
Emp. Form.C21H25NO3S2
Mol. Mass.403.558
SMILESCc1ccc(CSC[C@@H](NC(=O)[C@@H](CS)Cc2ccccc2)C(O)=O)cc1