Reaction Details
TargetAngiotensin-converting enzyme
LigandBDBM50039504
Substrate/Competitorn/a
Meas. Tech.ChEMBL_34913 (CHEMBL648449)
IC50 45±n/a nM
Citation Neustadt, BRSmith, EMNechuta, TLBronnenkant, AAHaslanger, MFWatkins, RWFoster, CJSybertz, EJ Mercaptoacyl amino acid inhibitors of atriopeptidase. 1. Structure-activity relationship studies of methionine and S-alkylcysteine derivatives. J Med Chem37:2461-76 (1994) Angiotensin-converting enzyme
Name:Angiotensin-converting enzyme
Type:n/a
Mol. Mass.:150405.15
Organism:Oryctolagus cuniculus
Description:n/a
Residue:1310
BDBM50039504
NameBDBM50039504
Synonyms:(S)-3-Ethylsulfanyl-2-(2-mercaptomethyl-3-phenyl-propionylamino)-propionic acid | CHEMBL82141
TypeSmall organic molecule
Emp. Form.C15H21NO3S2
Mol. Mass.327.462
SMILESCCSC[C@@H](NC(=O)C(CS)Cc1ccccc1)C(O)=O