Reaction Details
TargetNeprilysin
LigandBDBM50039537
Substrate/Competitorn/a
Meas. Tech.ChEMBL_144466 (CHEMBL755532)
IC50 2.5±n/a nM
Citation Neustadt, BRSmith, EMNechuta, TLBronnenkant, AAHaslanger, MFWatkins, RWFoster, CJSybertz, EJ Mercaptoacyl amino acid inhibitors of atriopeptidase. 1. Structure-activity relationship studies of methionine and S-alkylcysteine derivatives. J Med Chem37:2461-76 (1994) Neprilysin
Name:Neprilysin
Type:Enzyme
Mol. Mass.:85570.75
Organism:Oryctolagus cuniculus (rabbit)
Description:NEP was purified to homogeneity from rabbit kidney.
Residue:750
BDBM50039537
NameBDBM50039537
Synonyms:(R)-2-(2-Mercaptomethyl-pentanoylamino)-4-methylsulfanyl-butyric acid | CHEMBL79582
TypeSmall organic molecule
Emp. Form.C11H21NO3S2
Mol. Mass.279.419
SMILESCCCC(CS)C(=O)N[C@H](CCSC)C(O)=O