Reaction Details
TargetNeprilysin
LigandBDBM50039530
Substrate/Competitorn/a
Meas. Tech.ChEMBL_144466 (CHEMBL755532)
IC50 2.4±n/a nM
Citation Neustadt, BRSmith, EMNechuta, TLBronnenkant, AAHaslanger, MFWatkins, RWFoster, CJSybertz, EJ Mercaptoacyl amino acid inhibitors of atriopeptidase. 1. Structure-activity relationship studies of methionine and S-alkylcysteine derivatives. J Med Chem37:2461-76 (1994) Neprilysin
Name:Neprilysin
Type:Enzyme
Mol. Mass.:85570.75
Organism:Oryctolagus cuniculus (rabbit)
Description:NEP was purified to homogeneity from rabbit kidney.
Residue:750
BDBM50039530
NameBDBM50039530
Synonyms:(S)-3-Ethylsulfanyl-2-((S)-2-mercaptomethyl-3-phenyl-propionylamino)-propionic acid | CHEMBL84546
TypeSmall organic molecule
Emp. Form.C15H21NO3S2
Mol. Mass.327.462
SMILESCCSC[C@@H](NC(=O)[C@@H](CS)Cc1ccccc1)C(O)=O